BDBM50384975 CHEMBL2035058
SMILES Cc1nc(sc1C(Cc1c(F)cccc1C(F)(F)F)Sc1ccc(OCC(O)=O)c(C)c1)-c1ccc(cc1)C(F)(F)F
InChI Key InChIKey=TZFKQLSFWPNBEM-UHFFFAOYSA-N
Data  3 EC50
  Tab Delimited (TSV)   2D SDfile   Computed 3D by Vconf -m prep SDfile
Find this compound or compounds like it in BindingDB:
Activity Spreadsheet -- Enzyme Inhibition Constant Data from BindingDB
Found 3 hits for monomerid = 50384975
TargetPeroxisome proliferator-activated receptor delta(Homo sapiens (Human))
Seoul National University
Curated by ChEMBL
LigandPNGBDBM50384975(CHEMBL2035058)
Affinity DataEC50:  1.20nM. Assay description: Transactivation activity at human PPARdelta expressed in african green monkey CV1 cells after 24 hrs by luciferase reporter gene assay
In DepthDetails ArticlePubMed
TargetPeroxisome proliferator-activated receptor gamma(Homo sapiens (Human))
Seoul National University
Curated by ChEMBL
LigandPNGBDBM50384975(CHEMBL2035058)
Affinity DataEC50: >1.00E+4nM. Assay description: Transactivation activity at human PPARgamma expressed in african green monkey CV1 cells after 24 hrs by luciferase reporter gene assay
In DepthDetails ArticlePubMed
TargetPeroxisome proliferator-activated receptor alpha(Homo sapiens (Human))
Seoul National University
Curated by ChEMBL
LigandPNGBDBM50384975(CHEMBL2035058)
Affinity DataEC50: >1.00E+4nM. Assay description: Transactivation activity at human PPARalpha expressed in african green monkey CV1 cells after 24 hrs by luciferase reporter gene assay
In DepthDetails ArticlePubMed