BDBM50385065 CHEMBL2035614
SMILES Oc1ccc2c(c1)oc1c2nc([nH]c1=O)-c1ccccc1Cl
InChI Key InChIKey=XXHMHUZOEHCANX-UHFFFAOYSA-N
Data  3 IC50
  Tab Delimited (TSV)   2D SDfile   Computed 3D by Vconf -m prep SDfile
Find this compound or compounds like it in BindingDB:
Activity Spreadsheet -- Enzyme Inhibition Constant Data from BindingDB
Found 3 hits for monomerid = 50385065
TargetSerine/threonine-protein kinase pim-1(Homo sapiens (Human))
Exelixis
Curated by ChEMBL
LigandPNGBDBM50385065(CHEMBL2035614)
Affinity DataIC50:  205nM. Assay description: Inhibition of N-terminal His-tagged human PIM1 expressed in Escherichia coli using AKRRRLSA as substrate after 1 to 2 hrs by luciferasse-luciferin-co...
In DepthDetails ArticlePubMed
TargetSerine/threonine-protein kinase pim-3(Homo sapiens (Human))
Exelixis
Curated by ChEMBL
LigandPNGBDBM50385065(CHEMBL2035614)
Affinity DataIC50:  71nM. Assay description: Inhibition of N-terminal His-tagged human PIM3 expressed in Escherichia coli using AKRRRLSA as substrate after 1 to 2 hrs by luciferasse-luciferin-co...
In DepthDetails ArticlePubMed
TargetSerine/threonine-protein kinase pim-2(Homo sapiens (Human))
Exelixis
Curated by ChEMBL
LigandPNGBDBM50385065(CHEMBL2035614)
Affinity DataIC50:  2.38E+3nM. Assay description: Inhibition of N-terminal His-tagged human PIM2 expressed in Escherichia coli using AKRRRLSA as substrate after 1 to 2 hrs by luciferasse-luciferin-co...
In DepthDetails ArticlePubMed