BDBM50385077 CHEMBL2035628
SMILES Clc1cc(CNC2CCNCC2)ccc1-c1nc2c3cc(Br)ccc3oc2c(=O)[nH]1
InChI Key InChIKey=UJCZXEMKGRZREN-UHFFFAOYSA-N
Data  4 IC50
  Tab Delimited (TSV)   2D SDfile   Computed 3D by Vconf -m prep SDfile
Find this compound or compounds like it in BindingDB:
Activity Spreadsheet -- Enzyme Inhibition Constant Data from BindingDB
Found 4 hits for monomerid = 50385077
TargetSerine/threonine-protein kinase pim-1(Homo sapiens (Human))
Exelixis
Curated by ChEMBL
LigandPNGBDBM50385077(CHEMBL2035628)
Affinity DataIC50:  4nM. Assay description: Inhibition of N-terminal His-tagged human PIM1 expressed in Escherichia coli using AKRRRLSA as substrate after 1 to 2 hrs by luciferasse-luciferin-co...
In DepthDetails ArticlePubMed
TargetSerine/threonine-protein kinase pim-1(Homo sapiens (Human))
Exelixis
Curated by ChEMBL
LigandPNGBDBM50385077(CHEMBL2035628)
Affinity DataIC50:  4nM. Assay description: Inhibition of human recombinant PIM1 in presence of ATP by ELISA based spectrophotometric analysis
In DepthDetails ArticlePubMed
TargetSerine/threonine-protein kinase pim-3(Homo sapiens (Human))
Exelixis
Curated by ChEMBL
LigandPNGBDBM50385077(CHEMBL2035628)
Affinity DataIC50:  8nM. Assay description: Inhibition of N-terminal His-tagged human PIM3 expressed in Escherichia coli using AKRRRLSA as substrate after 1 to 2 hrs by luciferasse-luciferin-co...
In DepthDetails ArticlePubMed
TargetSerine/threonine-protein kinase pim-2(Homo sapiens (Human))
Exelixis
Curated by ChEMBL
LigandPNGBDBM50385077(CHEMBL2035628)
Affinity DataIC50:  29nM. Assay description: Inhibition of N-terminal His-tagged human PIM2 expressed in Escherichia coli using AKRRRLSA as substrate after 1 to 2 hrs by luciferasse-luciferin-co...
In DepthDetails ArticlePubMed