BDBM50385092 CHEMBL2035598
SMILES Clc1ccc2oc3c(nc([nH]c3=O)-c3ccccc3Cl)c2c1
InChI Key InChIKey=PHERSJGVHFLHAP-UHFFFAOYSA-N
Data  3 IC50
  Tab Delimited (TSV)   2D SDfile   Computed 3D by Vconf -m prep SDfile
Find this compound or compounds like it in BindingDB:
Activity Spreadsheet -- Enzyme Inhibition Constant Data from BindingDB
Found 3 hits for monomerid = 50385092
TargetSerine/threonine-protein kinase pim-2(Homo sapiens (Human))
Exelixis
Curated by ChEMBL
LigandPNGBDBM50385092(CHEMBL2035598)
Affinity DataIC50:  858nM. Assay description: Inhibition of N-terminal His-tagged human PIM2 expressed in Escherichia coli using AKRRRLSA as substrate after 1 to 2 hrs by luciferasse-luciferin-co...
In DepthDetails ArticlePubMed
TargetSerine/threonine-protein kinase pim-1(Homo sapiens (Human))
Exelixis
Curated by ChEMBL
LigandPNGBDBM50385092(CHEMBL2035598)
Affinity DataIC50:  28nM. Assay description: Inhibition of N-terminal His-tagged human PIM1 expressed in Escherichia coli using AKRRRLSA as substrate after 1 to 2 hrs by luciferasse-luciferin-co...
In DepthDetails ArticlePubMed
TargetSerine/threonine-protein kinase pim-3(Homo sapiens (Human))
Exelixis
Curated by ChEMBL
LigandPNGBDBM50385092(CHEMBL2035598)
Affinity DataIC50:  30nM. Assay description: Inhibition of N-terminal His-tagged human PIM3 expressed in Escherichia coli using AKRRRLSA as substrate after 1 to 2 hrs by luciferasse-luciferin-co...
In DepthDetails ArticlePubMed