BDBM50385095 CHEMBL2035607
SMILES Clc1ccccc1-c1nc2c3cc(ccc3oc2c(=O)[nH]1)C#N
InChI Key InChIKey=ZGYIJLHCURUFFT-UHFFFAOYSA-N
Data  3 IC50
  Tab Delimited (TSV)   2D SDfile   Computed 3D by Vconf -m prep SDfile
Find this compound or compounds like it in BindingDB:
Activity Spreadsheet -- Enzyme Inhibition Constant Data from BindingDB
Found 3 hits for monomerid = 50385095
TargetSerine/threonine-protein kinase pim-2(Homo sapiens (Human))
Exelixis
Curated by ChEMBL
LigandPNGBDBM50385095(CHEMBL2035607)
Affinity DataIC50:  3.43E+3nM. Assay description: Inhibition of N-terminal His-tagged human PIM2 expressed in Escherichia coli using AKRRRLSA as substrate after 1 to 2 hrs by luciferasse-luciferin-co...
In DepthDetails ArticlePubMed
TargetSerine/threonine-protein kinase pim-1(Homo sapiens (Human))
Exelixis
Curated by ChEMBL
LigandPNGBDBM50385095(CHEMBL2035607)
Affinity DataIC50:  281nM. Assay description: Inhibition of N-terminal His-tagged human PIM1 expressed in Escherichia coli using AKRRRLSA as substrate after 1 to 2 hrs by luciferasse-luciferin-co...
In DepthDetails ArticlePubMed
TargetSerine/threonine-protein kinase pim-3(Homo sapiens (Human))
Exelixis
Curated by ChEMBL
LigandPNGBDBM50385095(CHEMBL2035607)
Affinity DataIC50:  204nM. Assay description: Inhibition of N-terminal His-tagged human PIM3 expressed in Escherichia coli using AKRRRLSA as substrate after 1 to 2 hrs by luciferasse-luciferin-co...
In DepthDetails ArticlePubMed