BDBM50385207 CHEMBL2037328
SMILES CCCc1ccccc1-n1nc(C)c2[C@H](S[C@@H](C)C(=O)Nc12)c1ccc(Oc2ccccc2)cc1
InChI Key InChIKey=RJLHLYZVOCWLEN-CCLHPLFOSA-N
Data  1 EC50
  Tab Delimited (TSV)   2D SDfile   Computed 3D by Vconf -m prep SDfile
Find this compound or compounds like it in BindingDB:
Activity Spreadsheet -- Enzyme Inhibition Constant Data from BindingDB
Found 1 hit for monomerid = 50385207
TargetBile acid receptor(Homo sapiens (Human))
Universit£
Curated by ChEMBL
LigandPNGBDBM50385207(CHEMBL2037328)
Affinity DataEC50:  1.10E+3nM. Assay description: Agonist activity at human GST-tagged FXR ligand binding domain assessed as recruitment of Src-1 peptide after 30 mins by AlphaScreen assay
In DepthDetails ArticlePubMed