BDBM50385232 CHEMBL2037458
SMILES OC(=O)c1sc2c(Br)csc2c1Cl
InChI Key InChIKey=VQALBFAWFNPYAK-UHFFFAOYSA-N
Data  2 EC50
  Tab Delimited (TSV)   2D SDfile   Computed 3D by Vconf -m prep SDfile
Find this compound or compounds like it in BindingDB:
Activity Spreadsheet -- Enzyme Inhibition Constant Data from BindingDB
Found 2 hits for monomerid = 50385232
TargetG-protein coupled receptor 35(Homo sapiens (Human))
Corning
Curated by ChEMBL
LigandPNGBDBM50385232(CHEMBL2037458)
Affinity DataEC50:  3.92E+4nM. Assay description: Agonist activity at GPR35 in human U20S cells expressing beta-lactamase and Gal4-VP16 transcription factor assessed as beta arrestin translocation af...
In DepthDetails ArticlePubMed
TargetG-protein coupled receptor 35(Homo sapiens (Human))
Corning
Curated by ChEMBL
LigandPNGBDBM50385232(CHEMBL2037458)
Affinity DataEC50:  1.03E+3nM. Assay description: Agonist activity at GPR35 in human HT-29 cells by dynamic mass redistribution assay
In DepthDetails ArticlePubMed