BDBM50385271 CHEMBL2035493
SMILES O=c1n(CCn2sc3ccccc3c2=O)sc2ccccc12
InChI Key InChIKey=VNBNGXLQOCVGDL-UHFFFAOYSA-N
Data  1 IC50
  Tab Delimited (TSV)   2D SDfile   Computed 3D by Vconf -m prep SDfile
Find this compound or compounds like it in BindingDB:
Activity Spreadsheet -- Enzyme Inhibition Constant Data from BindingDB
Found 1 hit for monomerid = 50385271
TargetThioredoxin reductase 1, cytoplasmic(Rattus norvegicus)
Peking University
Curated by ChEMBL
LigandPNGBDBM50385271(CHEMBL2035493)
Affinity DataIC50:  4.81E+4nM. Assay description: Inhibition of TrxR1 in rat liver homogenate preincubated for 5 mins measured by DNTB assay
In DepthDetails ArticlePubMed