BDBM50385291 CHEMBL2035473
SMILES Cc1ccc2[se]n(CCCCCn3[se]c4ccc(C)cc4c3=O)c(=O)c2c1
InChI Key InChIKey=XUNAXWKPYVSIFE-UHFFFAOYSA-N
Data  1 IC50
  Tab Delimited (TSV)   2D SDfile   Computed 3D by Vconf -m prep SDfile
Find this compound or compounds like it in BindingDB:
Activity Spreadsheet -- Enzyme Inhibition Constant Data from BindingDB
Found 1 hit for monomerid = 50385291
TargetThioredoxin reductase 1, cytoplasmic(Rattus norvegicus)
Peking University
Curated by ChEMBL
LigandPNGBDBM50385291(CHEMBL2035473)
Affinity DataIC50:  3.16E+3nM. Assay description: Inhibition of TrxR1 in rat liver homogenate preincubated for 5 mins measured by DNTB assay
In DepthDetails ArticlePubMed