BDBM50385498 CHEMBL2040551
SMILES OC(=O)C(=O)CC(=O)C1(Cc2ccc(Cl)cc2)CCN(CC1)C(=O)c1ccc(c(c1)C(O)=O)-c1c2ccc(O)cc2oc2cc(=O)ccc12
InChI Key InChIKey=IQAOXMWFZDNQEX-UHFFFAOYSA-N
Data  1 Kd
  Tab Delimited (TSV)   2D SDfile   Computed 3D by Vconf -m prep SDfile
Find this compound or compounds like it in BindingDB:
Activity Spreadsheet -- Enzyme Inhibition Constant Data from BindingDB
Found 1 hit for monomerid = 50385498
TargetPolymerase acidic protein(Hepatitis C virus)
University Of Tennessee Health Science Center
Curated by ChEMBL
LigandPNGBDBM50385498(CHEMBL2040551)
Affinity DataKd:  350nM. Assay description: Binding affinity to PA N-terminal domain (Direct)
In DepthDetails ArticlePubMed