BDBM50385726 CHEMBL2043315
SMILES COc1cccc(Nc2cc(OC)ccc2C(O)=O)c1
InChI Key InChIKey=WKVVYZAWSBHCMA-UHFFFAOYSA-N
Data  2 IC50
  Tab Delimited (TSV)   2D SDfile   Computed 3D by Vconf -m prep SDfile
Find this compound or compounds like it in BindingDB:
Activity Spreadsheet -- Enzyme Inhibition Constant Data from BindingDB
Found 2 hits for monomerid = 50385726
TargetAldo-keto reductase family 1 member C2(Homo sapiens (Human))
University Of Pennsylvania
Curated by ChEMBL
LigandPNGBDBM50385726(CHEMBL2043315)
Affinity DataIC50:  1.47E+3nM. Assay description: Inhibition of recombinant AKR1C2 assessed as NADP+ dependent oxidation of S-tetralol by fluorescence assay
In DepthDetails ArticlePubMed
TargetAldo-keto reductase family 1 member C3(Homo sapiens (Human))
University Of Pennsylvania
Curated by ChEMBL
LigandPNGBDBM50385726(CHEMBL2043315)
Affinity DataIC50:  570nM. Assay description: Inhibition of recombinant AKR1C3 assessed as NADP+ dependent oxidation of S-tetralol by fluorescence assay
In DepthDetails ArticlePubMed