BDBM50385733 CHEMBL2040994
SMILES CC(=O)c1ccc(Nc2cccc(Cl)c2)c(c1)C(O)=O
InChI Key InChIKey=FDNHIBIXWYRZJG-UHFFFAOYSA-N
Data  2 IC50
  Tab Delimited (TSV)   2D SDfile   Computed 3D by Vconf -m prep SDfile
Find this compound or compounds like it in BindingDB:
Activity Spreadsheet -- Enzyme Inhibition Constant Data from BindingDB
Found 2 hits for monomerid = 50385733
TargetAldo-keto reductase family 1 member C2(Homo sapiens (Human))
University Of Pennsylvania
Curated by ChEMBL
LigandPNGBDBM50385733(CHEMBL2040994)
Affinity DataIC50:  2.55E+3nM. Assay description: Inhibition of recombinant AKR1C2 assessed as NADP+ dependent oxidation of S-tetralol by fluorescence assay
In DepthDetails ArticlePubMed
TargetAldo-keto reductase family 1 member C3(Homo sapiens (Human))
University Of Pennsylvania
Curated by ChEMBL
LigandPNGBDBM50385733(CHEMBL2040994)
Affinity DataIC50:  1.16E+3nM. Assay description: Inhibition of recombinant AKR1C3 assessed as NADP+ dependent oxidation of S-tetralol by fluorescence assay
In DepthDetails ArticlePubMed