BDBM50385768 CHEMBL2043321
SMILES COc1ccc(C(O)=O)c(Nc2ccc(Br)cc2)c1
InChI Key InChIKey=XXBQFIRXYKENCR-UHFFFAOYSA-N
Data  2 IC50
  Tab Delimited (TSV)   2D SDfile   Computed 3D by Vconf -m prep SDfile
Find this compound or compounds like it in BindingDB:
Activity Spreadsheet -- Enzyme Inhibition Constant Data from BindingDB
Found 2 hits for monomerid = 50385768
TargetAldo-keto reductase family 1 member C3(Homo sapiens (Human))
University Of Pennsylvania
Curated by ChEMBL
LigandPNGBDBM50385768(CHEMBL2043321)
Affinity DataIC50:  150nM. Assay description: Inhibition of recombinant AKR1C3 assessed as NADP+ dependent oxidation of S-tetralol by fluorescence assay
In DepthDetails ArticlePubMed
TargetAldo-keto reductase family 1 member C2(Homo sapiens (Human))
University Of Pennsylvania
Curated by ChEMBL
LigandPNGBDBM50385768(CHEMBL2043321)
Affinity DataIC50:  540nM. Assay description: Inhibition of recombinant AKR1C2 assessed as NADP+ dependent oxidation of S-tetralol by fluorescence assay
In DepthDetails ArticlePubMed