BDBM50386059 CHEMBL2043058
SMILES COc1cc2C\C(=C\c3ccncc3)C(=O)c2cc1OCCCCN1CCCC1
InChI Key InChIKey=HSKVKKNWCNJPMX-ZHZULCJRSA-N
Data  2 IC50
  Tab Delimited (TSV)   2D SDfile   Computed 3D by Vconf -m prep SDfile
Find this compound or compounds like it in BindingDB:
Activity Spreadsheet -- Enzyme Inhibition Constant Data from BindingDB
Found 2 hits for monomerid = 50386059
TargetAcetylcholinesterase(Electrophorus electricus (Electric eel))
Sun Yat-Sen University
Curated by ChEMBL
LigandPNGBDBM50386059(CHEMBL2043058)
Affinity DataIC50:  156nM. Assay description: Inhibition of electric eel acetylcholine esterase using acetylcholine chloride as substrate incubated for 15 mins prior to substrate addition measure...
In DepthDetails ArticlePubMed
TargetCholinesterase(Equus caballus (Horse))
Sun Yat-Sen University
Curated by ChEMBL
LigandPNGBDBM50386059(CHEMBL2043058)
Affinity DataIC50:  1.75E+4nM. Assay description: Inhibition of equine serum butyrylcholinesterase using butylthiocholine chloride as substrate incubated for 15 mins prior to substrate addition measu...
In DepthDetails ArticlePubMed