BDBM50386208 CHEMBL2043399
SMILES N[C@@H](CSC(Cc1ccccc1)(c1ccccc1)c1ccc(F)cc1)C(O)=O
InChI Key InChIKey=OTLCMKQJGDNWTD-BBQAJUCSSA-N
Data  1 IC50
  Tab Delimited (TSV)   2D SDfile   Computed 3D by Vconf -m prep SDfile
Find this compound or compounds like it in BindingDB:
Activity Spreadsheet -- Enzyme Inhibition Constant Data from BindingDB
Found 1 hit for monomerid = 50386208
TargetKinesin-like protein KIF11(Homo sapiens (Human))
University Of Strathclyde
Curated by ChEMBL
LigandPNGBDBM50386208(CHEMBL2043399)
Affinity DataIC50:  151nM. Assay description: Inhibition of basal ATPase activity of Eg5 by coupled pyruvate kinase/lactate dehydrogenase assay
In DepthDetails ArticlePubMed