BDBM50386269 CHEMBL2040981
SMILES FC(F)(F)c1ccc(cc1)C(=O)N1Cc2ccccc2C[C@H]1C(=O)Nc1ccc(cc1)N1CCCCC1=O
InChI Key InChIKey=OKIADTSUFMQKIV-VWLOTQADSA-N
Data  1 IC50
  Tab Delimited (TSV)   2D SDfile   Computed 3D by Vconf -m prep SDfile
Find this compound or compounds like it in BindingDB:
Activity Spreadsheet -- Enzyme Inhibition Constant Data from BindingDB
Found 1 hit for monomerid = 50386269
TargetCoagulation factor X(Homo sapiens (Human))
Virginia Commonwealth University
Curated by ChEMBL
LigandPNGBDBM50386269(CHEMBL2040981)
Affinity DataIC50:  1.33E+4nM. Assay description: Inhibition of human factor 10a using chromogenic spectrozyme F10a as substrate after 10 mins by spectrophotometry
In DepthDetails ArticlePubMed