BDBM50386282 CHEMBL2040852
SMILES CN(C(=O)[C@@H]1Cc2ccccc2CN1S(=O)(=O)Cc1ccc(Cl)cc1)c1ccc(cc1)N1CCCCC1=O
InChI Key InChIKey=SGENHUFKTDEVIG-MHZLTWQESA-N
Data  1 IC50
  Tab Delimited (TSV)   2D SDfile   Computed 3D by Vconf -m prep SDfile
Find this compound or compounds like it in BindingDB:
Activity Spreadsheet -- Enzyme Inhibition Constant Data from BindingDB
Found 1 hit for monomerid = 50386282
TargetCoagulation factor X(Homo sapiens (Human))
Virginia Commonwealth University
Curated by ChEMBL
LigandPNGBDBM50386282(CHEMBL2040852)
Affinity DataIC50:  1.51E+5nM. Assay description: Inhibition of human factor 10a using chromogenic spectrozyme F10a as substrate after 10 mins by spectrophotometry
In DepthDetails ArticlePubMed