BDBM50386391 CHEMBL1411333
SMILES CCCC(=O)Nc1cccc(NC(=O)c2ccccc2Br)c1
InChI Key InChIKey=DFOVLSMXPWPCFH-UHFFFAOYSA-N
Data  5 IC50
  Tab Delimited (TSV)   2D SDfile   Computed 3D by Vconf -m prep SDfile
Find this compound or compounds like it in BindingDB:
Activity Spreadsheet -- Enzyme Inhibition Constant Data from BindingDB
Found 5 hits for monomerid = 50386391
TargetProteinase-activated receptor 1(Homo sapiens (Human))
TBA
Curated by ChEMBL
LigandPNGBDBM50386391(CHEMBL1411333)
Affinity DataIC50:  260nM. Assay description: Inhibition of SFLLRN-NH2-stimulated PAR1-mediated platelet activation in platelet-rich human plasma assessed as surface expression of P-selectin afte...
In DepthDetails ArticlePubMed
TargetProteinase-activated receptor 1(Homo sapiens (Human))
TBA
Curated by ChEMBL
LigandPNGBDBM50386391(CHEMBL1411333)
Affinity DataIC50:  199nM. Assay description: Antagonist activity at PAR1 in human EAhy926 cells assessed as inhibition of TFLLRN-NH2-induced intracellular calcium mobilization pretreated for 15 ...
In DepthDetails ArticlePubMed
TargetProteinase-activated receptor 1(Homo sapiens (Human))
TBA
Curated by ChEMBL
LigandPNGBDBM50386391(CHEMBL1411333)
Affinity DataIC50:  794nM. Assay description: Negative allosteric modulation of PAR1 in human EAhy926 cells assessed as reduction in TFLLRN-NH2-induced intracellular calcium mobilization incubate...
In DepthDetails ArticlePubMed
TargetProteinase-activated receptor 1(Homo sapiens (Human))
TBA
Curated by ChEMBL
LigandPNGBDBM50386391(CHEMBL1411333)
Affinity DataIC50:  794nM. Assay description: Negative allosteric modulation of PAR1 in human EAhy926 cells assessed as reduction in TFLLRN-NH2-induced intracellular calcium mobilization incubate...
In DepthDetails ArticlePubMed
TargetProteinase-activated receptor 1(Homo sapiens (Human))
TBA
Curated by ChEMBL
LigandPNGBDBM50386391(CHEMBL1411333)
Affinity DataIC50:  200nM. Assay description: Antagonist activity at PAR1 in human EAhy926 cells assessed as inhibition of TFLLRN-NH2-induced intracellular calcium mobilization pretreated for 15 ...
In DepthDetails ArticlePubMed