BDBM50386479 CHEMBL2048056
SMILES CC(C)(C)O[C@H]1C[C@@H]1CN[C@H]1CS(=O)(=O)C[C@@H](Cc2cc(F)c(N)c(OC(C(F)(F)F)C(F)(F)F)c2)[C@@H]1O
InChI Key InChIKey=RNURIPCMDOBQGW-LBMFQQPPSA-N
Data  2 IC50
  Tab Delimited (TSV)   2D SDfile   Computed 3D by Vconf -m prep SDfile
Find this compound or compounds like it in BindingDB:
Activity Spreadsheet -- Enzyme Inhibition Constant Data from BindingDB
Found 2 hits for monomerid = 50386479
TargetCathepsin D(Homo sapiens (Human))
Novartis Pharma
Curated by ChEMBL
LigandPNGBDBM50386479(CHEMBL2048056)
Affinity DataIC50:  3.71E+3nM. Assay description: Inhibition of human recombinant CatD using Mca-GKPILFFRLK(DNP)-dR-NH2 as substrate after 1 hr by fluorescence analysis
In DepthDetails ArticlePubMed
TargetBeta-secretase 1(Homo sapiens (Human))
Novartis Pharma
Curated by ChEMBL
LigandPNGBDBM50386479(CHEMBL2048056)
Affinity DataIC50: >1.00E+4nM. Assay description: Inhibition of human recombinant BACE1 ectodomain after 1 hr by fluorescence analysis
In DepthDetails ArticlePubMed