BDBM50386501 CHEMBL2048038
SMILES CCCOc1cc(C[C@@H]2CS(=O)(=O)C[C@H](NCc3cccc(c3)C(C)(C)C)[C@H]2O)cc(F)c1N
InChI Key InChIKey=YVVYDXSFDQXZJS-WPWBMXPQSA-N
Data  3 IC50
  Tab Delimited (TSV)   2D SDfile   Computed 3D by Vconf -m prep SDfile
Find this compound or compounds like it in BindingDB:
Activity Spreadsheet -- Enzyme Inhibition Constant Data from BindingDB
Found 3 hits for monomerid = 50386501
TargetBeta-secretase 1(Homo sapiens (Human))
Novartis Pharma
Curated by ChEMBL
LigandPNGBDBM50386501(CHEMBL2048038)
Affinity DataIC50:  56nM. Assay description: Inhibition of human recombinant BACE1 ectodomain after 1 hr by fluorescence analysis
In DepthDetails ArticlePubMed
TargetCathepsin D(Homo sapiens (Human))
Novartis Pharma
Curated by ChEMBL
LigandPNGBDBM50386501(CHEMBL2048038)
Affinity DataIC50:  2.22E+3nM. Assay description: Inhibition of human recombinant CatD using Mca-GKPILFFRLK(DNP)-dR-NH2 as substrate after 1 hr by fluorescence analysis
In DepthDetails ArticlePubMed
TargetBeta-secretase 1(Homo sapiens (Human))
Novartis Pharma
Curated by ChEMBL
LigandPNGBDBM50386501(CHEMBL2048038)
Affinity DataIC50:  424nM. Assay description: Inhibition of BACE-1 mediated amyloid beta 40 release in human wild type APP-transfected CHO cells by HTRF immunoassay
In DepthDetails ArticlePubMed