BDBM50386502 CHEMBL2048039
SMILES CCOc1cc(C[C@@H]2CS(=O)(=O)C[C@H](NCc3cccc(c3)C(C)(C)C)[C@H]2O)cc(F)c1N
InChI Key InChIKey=QNARTEMYCRFHBN-ZHRMCQFGSA-N
Data  3 IC50
  Tab Delimited (TSV)   2D SDfile   Computed 3D by Vconf -m prep SDfile
Find this compound or compounds like it in BindingDB:
Activity Spreadsheet -- Enzyme Inhibition Constant Data from BindingDB
Found 3 hits for monomerid = 50386502
TargetBeta-secretase 1(Homo sapiens (Human))
Novartis Pharma
Curated by ChEMBL
LigandPNGBDBM50386502(CHEMBL2048039)
Affinity DataIC50:  24nM. Assay description: Inhibition of human recombinant BACE1 ectodomain after 1 hr by fluorescence analysis
In DepthDetails ArticlePubMed
TargetCathepsin D(Homo sapiens (Human))
Novartis Pharma
Curated by ChEMBL
LigandPNGBDBM50386502(CHEMBL2048039)
Affinity DataIC50:  1.03E+3nM. Assay description: Inhibition of human recombinant CatD using Mca-GKPILFFRLK(DNP)-dR-NH2 as substrate after 1 hr by fluorescence analysis
In DepthDetails ArticlePubMed
TargetBeta-secretase 1(Homo sapiens (Human))
Novartis Pharma
Curated by ChEMBL
LigandPNGBDBM50386502(CHEMBL2048039)
Affinity DataIC50:  150nM. Assay description: Inhibition of BACE-1 mediated amyloid beta 40 release in human wild type APP-transfected CHO cells by HTRF immunoassay
In DepthDetails ArticlePubMed