BDBM50386731 CHEMBL2048934
SMILES CCOc1ccc2C(N(CCc2c1)S(N)(=O)=O)c1ccc(cc1)S(N)(=O)=O
InChI Key InChIKey=ULDIKWJEEXBIOV-UHFFFAOYSA-N
Data  5 KI
  Tab Delimited (TSV)   2D SDfile   Computed 3D by Vconf -m prep SDfile
Find this compound or compounds like it in BindingDB:
Activity Spreadsheet -- Enzyme Inhibition Constant Data from BindingDB
Found 5 hits for monomerid = 50386731
TargetCarbonic anhydrase 14(Homo sapiens (Human))
Universit£
Curated by ChEMBL
LigandPNGBDBM50386731(CHEMBL2048934)
Affinity DataKi:  6.70nM. Assay description: Inhibition of human recombinant full length CA14-mediated CO2 hydration preincubated for 15 mins by stopped-flow assay
In DepthDetails ArticlePubMed
TargetCarbonic anhydrase 7(Homo sapiens (Human))
Universit£
Curated by ChEMBL
LigandPNGBDBM50386731(CHEMBL2048934)
Affinity DataKi:  17.8nM. Assay description: Inhibition of human recombinant full length CA7-mediated CO2 hydration preincubated for 15 mins by stopped-flow assay
In DepthDetails ArticlePubMed
TargetCarbonic anhydrase 2(Homo sapiens (Human))
Universit£
Curated by ChEMBL
LigandPNGBDBM50386731(CHEMBL2048934)
Affinity DataKi:  33.2nM. Assay description: Inhibition of human recombinant full length CA2-mediated CO2 hydration preincubated for 15 mins by stopped-flow assay
In DepthDetails ArticlePubMed
TargetCarbonic anhydrase 9(Homo sapiens (Human))
Universit£
Curated by ChEMBL
LigandPNGBDBM50386731(CHEMBL2048934)
Affinity DataKi:  52.1nM. Assay description: Inhibition of human recombinant CA9 catalytic domain-mediated CO2 hydration preincubated for 15 mins by stopped-flow assay
In DepthDetails ArticlePubMed
TargetCarbonic anhydrase 1(Homo sapiens (Human))
Universit£
Curated by ChEMBL
LigandPNGBDBM50386731(CHEMBL2048934)
Affinity DataKi:  4.17E+3nM. Assay description: Inhibition of human recombinant full length CA1-mediated CO2 hydration preincubated for 15 mins by stopped-flow assay
In DepthDetails ArticlePubMed