BDBM50386921 CHEMBL2046466
SMILES Fc1ccc(cc1)-c1nc2nccc(C(=O)NCCCc3ccc(Cl)nc3)c2[nH]1
InChI Key InChIKey=PRMIUWPTXICFLU-UHFFFAOYSA-N
Data  1 IC50  1 EC50
  Tab Delimited (TSV)   2D SDfile   Computed 3D by Vconf -m prep SDfile
Find this compound or compounds like it in BindingDB:
Activity Spreadsheet -- Enzyme Inhibition Constant Data from BindingDB
Found 2 hits for monomerid = 50386921
TargetGlycogen synthase kinase-3 beta(Homo sapiens (Human))
Crystalgenomics
Curated by ChEMBL
LigandPNGBDBM50386921(CHEMBL2046466)
Affinity DataEC50:  250nM. Assay description: Inhibition of GSK3B in human Rd cells
In DepthDetails ArticlePubMed
TargetGlycogen synthase kinase-3 beta(Homo sapiens (Human))
Crystalgenomics
Curated by ChEMBL
LigandPNGBDBM50386921(CHEMBL2046466)
Affinity DataIC50:  17nM. Assay description: Inhibition of human GSK3beta using phospho-CREB as substrate by beta counting method
In DepthDetails ArticlePubMed