BDBM50387335 CHEMBL2046628
SMILES NCC1CCN(C1)c1cccc(n1)C(=O)c1cccnc1N
InChI Key InChIKey=NLQZBYVNNTWLCQ-UHFFFAOYSA-N
Data  1 KI
  Tab Delimited (TSV)   2D SDfile   Computed 3D by Vconf -m prep SDfile
Find this compound or compounds like it in BindingDB:
Activity Spreadsheet -- Enzyme Inhibition Constant Data from BindingDB
Found 1 hit for monomerid = 50387335
TargetProtein kinase C theta type(Homo sapiens (Human))
Vertex Pharmaceuticals
Curated by ChEMBL
LigandPNGBDBM50387335(CHEMBL2046628)
Affinity DataKi:  745nM. Assay description: Inhibition of PKCtheta
In DepthDetails ArticlePubMed