BDBM50387347 CHEMBL2046641
SMILES Nc1ncccc1C(=O)c1cccc(n1)N1CCN[C@@H](C1)c1ccccc1
InChI Key InChIKey=ZYTHRQIDZFTPKA-SFHVURJKSA-N
Data  1 KI
  Tab Delimited (TSV)   2D SDfile   Computed 3D by Vconf -m prep SDfile
Find this compound or compounds like it in BindingDB:
Activity Spreadsheet -- Enzyme Inhibition Constant Data from BindingDB
Found 1 hit for monomerid = 50387347
TargetProtein kinase C theta type(Homo sapiens (Human))
Vertex Pharmaceuticals
Curated by ChEMBL
LigandPNGBDBM50387347(CHEMBL2046641)
Affinity DataKi:  238nM. Assay description: Inhibition of PKCtheta
In DepthDetails ArticlePubMed