BDBM50387381 CHEMBL2047094
SMILES OC(=O)c1c(oc2ccc(OCc3cccc(Cl)c3)cc12)-c1ccc2ccccc2c1
InChI Key InChIKey=PDUYDVLIUPDCCD-UHFFFAOYSA-N
Data  1 IC50
  Tab Delimited (TSV)   2D SDfile   Computed 3D by Vconf -m prep SDfile
Find this compound or compounds like it in BindingDB:
Activity Spreadsheet -- Enzyme Inhibition Constant Data from BindingDB
Found 1 hit for monomerid = 50387381
TargetAnoctamin-1(Homo sapiens (Human))
Kurukshetra University
Curated by ChEMBL
LigandPNGBDBM50387381(CHEMBL2047094)
Affinity DataIC50:  7.70E+3nM. Assay description: Inhibition of human TMEM16A transfected in FRT cells assessed as iodide influx using YFP-F46L/H148Q/I152L halide sensor after 10 mins by spectrofluor...
In DepthDetails ArticlePubMed