BDBM50387453 CHEMBL2047471
SMILES CNC1CN(C1)C(=O)c1cc2cc(Cl)cc(F)c2[nH]1
InChI Key InChIKey=ZSKPBGNERYGHMM-UHFFFAOYSA-N
Data  1 KI
  Tab Delimited (TSV)   2D SDfile   Computed 3D by Vconf -m prep SDfile
Find this compound or compounds like it in BindingDB:
Activity Spreadsheet -- Enzyme Inhibition Constant Data from BindingDB
Found 1 hit for monomerid = 50387453
TargetHistamine H4 receptor(Homo sapiens (Human))
Boehringer Ingelheim Rcv
Curated by ChEMBL
LigandPNGBDBM50387453(CHEMBL2047471)
Affinity DataKi:  100nM. Assay description: Displacement of [3H]histamine from human histamine H4 receptor expressed in HEK cells
In DepthDetails ArticlePubMed