BDBM50387547 CHEMBL2057369
SMILES CC(C)(C)NS(=O)(=O)c1cncc(c1)-c1ccc2nc(NC(=O)NCCCn3nnc(n3)C3CC3)nn2c1
InChI Key InChIKey=KWIPWMYEDATTRB-UHFFFAOYSA-N
Data  4 IC50
  Tab Delimited (TSV)   2D SDfile   Computed 3D by Vconf -m prep SDfile
Find this compound or compounds like it in BindingDB:
Activity Spreadsheet -- Enzyme Inhibition Constant Data from BindingDB
Found 4 hits for monomerid = 50387547
LigandPNGBDBM50387547(CHEMBL2057369)
Affinity DataIC50:  50.1nM. Assay description: Inhibition of PI3Kdelta in human HL60 cell lysate by kinobead assay
In DepthDetails ArticlePubMed
LigandPNGBDBM50387547(CHEMBL2057369)
Affinity DataIC50:  63.1nM. Assay description: Inhibition of PI3Kgamma in human HL60 cell lysate by kinobead assay
In DepthDetails ArticlePubMed
LigandPNGBDBM50387547(CHEMBL2057369)
Affinity DataIC50:  2.51E+3nM. Assay description: Inhibition of PI3Kbeta in human HL60 cell lysate by kinobead assay
In DepthDetails ArticlePubMed
LigandPNGBDBM50387547(CHEMBL2057369)
Affinity DataIC50: >6.31E+3nM. Assay description: Inhibition of PI3Kalpha in human HL60 cell lysate by kinobead assay
In DepthDetails ArticlePubMed