BDBM50387810 CHEMBL2058370
SMILES CCCCc1nc2ccccc2n1Cc1ccc(cc1)-c1ccccc1S(=O)(=O)Nc1onc(C)c1C
InChI Key InChIKey=YABUJJGOFUBCLX-UHFFFAOYSA-N
Data  2 IC50
  Tab Delimited (TSV)   2D SDfile   Computed 3D by Vconf -m prep SDfile
Find this compound or compounds like it in BindingDB:
Activity Spreadsheet -- Enzyme Inhibition Constant Data from BindingDB
Found 2 hits for monomerid = 50387810
TargetEndothelin-1 receptor(Homo sapiens (Human))
China Pharmaceutical University
Curated by ChEMBL
LigandPNGBDBM50387810(CHEMBL2058370)
Affinity DataIC50:  9.80nM. Assay description: Antagonist activity at human endothelin receptor subtype A expressed in CHO-K1 cells
In DepthDetails ArticlePubMed
TargetType-1 angiotensin II receptor(Bos taurus)
China Pharmaceutical University
Curated by ChEMBL
LigandPNGBDBM50387810(CHEMBL2058370)
Affinity DataIC50:  9.90nM. Assay description: Displacement of [125I]AngII from type 1 angiotensin 2 receptor in bovine adrenal cortex
In DepthDetails ArticlePubMed