BDBM50388085 CHEMBL2057857
SMILES COc1cc(ccc1O)C(C)C(=O)NCCCc1ccc(C)c(C)c1
InChI Key InChIKey=IEUGVHZUTZSNDR-UHFFFAOYSA-N
Data  1 KI  1 EC50
  Tab Delimited (TSV)   2D SDfile   Computed 3D by Vconf -m prep SDfile
Find this compound or compounds like it in BindingDB:
Activity Spreadsheet -- Enzyme Inhibition Constant Data from BindingDB
Found 2 hits for monomerid = 50388085
TargetTransient receptor potential cation channel subfamily V member 1(Rattus norvegicus (rat))
Seoul National University
Curated by ChEMBL
LigandPNGBDBM50388085(CHEMBL2057857)
Affinity DataKi:  177nM. Assay description: Displacement of [3H]RTX from rat TRPV1 expressed in CHO cells
In DepthDetails ArticlePubMed
TargetTransient receptor potential cation channel subfamily V member 1(Rattus norvegicus (rat))
Seoul National University
Curated by ChEMBL
LigandPNGBDBM50388085(CHEMBL2057857)
Affinity DataEC50:  21.3nM. Assay description: Agonist activity at rat TRPV1 expressed in CHO cells assessed as calcium uptake
In DepthDetails ArticlePubMed