BDBM50388278 CHEMBL2058232
SMILES COc1ccc(CC[C@@H](OC(=O)[C@@H]2CCCCN2S(=O)(=O)c2cccc(F)c2)c2cccc(OCC(O)=O)c2)cc1OC
InChI Key InChIKey=CQAQXBDVMQFNRY-RRPNLBNLSA-N
Data  3 IC50
  Tab Delimited (TSV)   2D SDfile   Computed 3D by Vconf -m prep SDfile
Find this compound or compounds like it in BindingDB:
Activity Spreadsheet -- Enzyme Inhibition Constant Data from BindingDB
Found 3 hits for monomerid = 50388278
TargetPeptidyl-prolyl cis-trans isomerase FKBP5(Homo sapiens (Human))
Max Planck Institute Of Psychiatry
Curated by ChEMBL
LigandPNGBDBM50388278(CHEMBL2058232)
Affinity DataIC50:  5.41E+4nM. Assay description: Binding affinity to FKBP51 FK1 domain by competitive fluorescence polarization assay
In DepthDetails ArticlePubMed
TargetPeptidyl-prolyl cis-trans isomerase FKBP1A(Homo sapiens (Human))
Max Planck Institute Of Psychiatry
Curated by ChEMBL
LigandPNGBDBM50388278(CHEMBL2058232)
Affinity DataIC50:  1.09E+3nM. Assay description: Binding affinity to FKBP12 by competitive fluorescence polarization assay
In DepthDetails ArticlePubMed
TargetPeptidyl-prolyl cis-trans isomerase FKBP4(Homo sapiens (Human))
Max Planck Institute Of Psychiatry
Curated by ChEMBL
LigandPNGBDBM50388278(CHEMBL2058232)
Affinity DataIC50:  8.45E+4nM. Assay description: Binding affinity to FKBP52 FK1 domain by competitive fluorescence polarization assay
In DepthDetails ArticlePubMed