BDBM50388283 CHEMBL2058237
SMILES COc1ccc(cc1Cl)S(=O)(=O)N1CCCC[C@H]1C(=O)O[C@H](CCc1ccc(OC)c(OC)c1)c1cccc(OCC(O)=O)c1
InChI Key InChIKey=CPKXFLMGGNEACL-RRPNLBNLSA-N
Data  3 IC50
  Tab Delimited (TSV)   2D SDfile   Computed 3D by Vconf -m prep SDfile
Find this compound or compounds like it in BindingDB:
Activity Spreadsheet -- Enzyme Inhibition Constant Data from BindingDB
Found 3 hits for monomerid = 50388283
TargetPeptidyl-prolyl cis-trans isomerase FKBP5(Homo sapiens (Human))
Max Planck Institute Of Psychiatry
Curated by ChEMBL
LigandPNGBDBM50388283(CHEMBL2058237)
Affinity DataIC50:  2.96E+4nM. Assay description: Binding affinity to FKBP51 FK1 domain by competitive fluorescence polarization assay
In DepthDetails ArticlePubMed
TargetPeptidyl-prolyl cis-trans isomerase FKBP1A(Homo sapiens (Human))
Max Planck Institute Of Psychiatry
Curated by ChEMBL
LigandPNGBDBM50388283(CHEMBL2058237)
Affinity DataIC50:  600nM. Assay description: Binding affinity to FKBP12 by competitive fluorescence polarization assay
In DepthDetails ArticlePubMed
TargetPeptidyl-prolyl cis-trans isomerase FKBP4(Homo sapiens (Human))
Max Planck Institute Of Psychiatry
Curated by ChEMBL
LigandPNGBDBM50388283(CHEMBL2058237)
Affinity DataIC50:  4.03E+4nM. Assay description: Binding affinity to FKBP52 FK1 domain by competitive fluorescence polarization assay
In DepthDetails ArticlePubMed