BDBM50388322 CHEMBL2059036
SMILES COc1ccc(CC[C@@H](OC(=O)[C@@H]2CCCCN2C(=O)C(=O)[C@]2(O)CCCC[C@H]2CO)c2cccc(OCC(O)=O)c2)cc1OC
InChI Key InChIKey=BMHHSAHMWBFZQC-XHVASCMLSA-N
Data  3 IC50
  Tab Delimited (TSV)   2D SDfile   Computed 3D by Vconf -m prep SDfile
Find this compound or compounds like it in BindingDB:
Activity Spreadsheet -- Enzyme Inhibition Constant Data from BindingDB
Found 3 hits for monomerid = 50388322
TargetPeptidyl-prolyl cis-trans isomerase FKBP1A(Homo sapiens (Human))
Max Planck Institute Of Psychiatry
Curated by ChEMBL
LigandPNGBDBM50388322(CHEMBL2059036)
Affinity DataIC50:  510nM. Assay description: Binding affinity to FKBP12 by fluorescence polarization assay
In DepthDetails ArticlePubMed
TargetPeptidyl-prolyl cis-trans isomerase FKBP4(Homo sapiens (Human))
Max Planck Institute Of Psychiatry
Curated by ChEMBL
LigandPNGBDBM50388322(CHEMBL2059036)
Affinity DataIC50:  6.20E+3nM. Assay description: Binding affinity to FKBP52 FK1 domain by fluorescence polarization assay
In DepthDetails ArticlePubMed
TargetPeptidyl-prolyl cis-trans isomerase FKBP5(Homo sapiens (Human))
Max Planck Institute Of Psychiatry
Curated by ChEMBL
LigandPNGBDBM50388322(CHEMBL2059036)
Affinity DataIC50:  8.50E+3nM. Assay description: Binding affinity to FKBP51 FK1 domain by fluorescence polarization assay
In DepthDetails ArticlePubMed