BDBM50388556 CHEMBL2059278
SMILES CS(=O)(=O)NCCCCn1c2-c3ccccc3C(=O)c2c2ccccc2c1=O
InChI Key InChIKey=ZLZWYXYXWXUXRL-UHFFFAOYSA-N
Data  1 IC50
  Tab Delimited (TSV)   2D SDfile   Computed 3D by Vconf -m prep SDfile
Find this compound or compounds like it in BindingDB:
Activity Spreadsheet -- Enzyme Inhibition Constant Data from BindingDB
Found 1 hit for monomerid = 50388556
TargetTyrosyl-DNA phosphodiesterase 1(Homo sapiens (Human))
Purdue University
Curated by ChEMBL
LigandPNGBDBM50388556(CHEMBL2059278)
Affinity DataIC50: >1.11E+5nM. Assay description: Inhibition of human recombinant Tdp1 using 5'-[32P]-labeled single-stranded DNA oligonucleotide containing 3'-phosphotyrosine as substrate assessed a...
In DepthDetails ArticlePubMed