BDBM50388570 CHEMBL2059532
SMILES O=C1c2ccccc2-c2c1c1ccccc1c(=O)n2CCCCCCCCCCCNS(=O)(=O)c1ccccc1
InChI Key InChIKey=WNTZFQVFFDSNSY-UHFFFAOYSA-N
Data  1 IC50
  Tab Delimited (TSV)   2D SDfile   Computed 3D by Vconf -m prep SDfile
Find this compound or compounds like it in BindingDB:
Activity Spreadsheet -- Enzyme Inhibition Constant Data from BindingDB
Found 1 hit for monomerid = 50388570
TargetTyrosyl-DNA phosphodiesterase 1(Homo sapiens (Human))
Purdue University
Curated by ChEMBL
LigandPNGBDBM50388570(CHEMBL2059532)
Affinity DataIC50: >1.11E+5nM. Assay description: Inhibition of human recombinant Tdp1 using 5'-[32P]-labeled single-stranded DNA oligonucleotide containing 3'-phosphotyrosine as substrate assessed a...
In DepthDetails ArticlePubMed