BDBM50388580 CHEMBL2059748
SMILES Brc1ccc(cc1)S(=O)(=O)NCCCn1c2-c3ccccc3C(=O)c2c2ccccc2c1=O
InChI Key InChIKey=BTECHVBSKUPBOS-UHFFFAOYSA-N
Data  1 IC50
  Tab Delimited (TSV)   2D SDfile   Computed 3D by Vconf -m prep SDfile
Find this compound or compounds like it in BindingDB:
Activity Spreadsheet -- Enzyme Inhibition Constant Data from BindingDB
Found 1 hit for monomerid = 50388580
TargetTyrosyl-DNA phosphodiesterase 1(Homo sapiens (Human))
Purdue University
Curated by ChEMBL
LigandPNGBDBM50388580(CHEMBL2059748)
Affinity DataIC50: >1.11E+5nM. Assay description: Inhibition of human recombinant Tdp1 using 5'-[32P]-labeled single-stranded DNA oligonucleotide containing 3'-phosphotyrosine as substrate assessed a...
In DepthDetails ArticlePubMed