BDBM50388645 CHEMBL2059572
SMILES [O-][N+](=O)c1ccc(CN(CC2CCN(C2)C(=O)OCC=C)Cc2ccc(Cl)cc2)s1
InChI Key InChIKey=UFRUPQVJSWIPPX-UHFFFAOYSA-N
Data  1 EC50
  Tab Delimited (TSV)   2D SDfile   Computed 3D by Vconf -m prep SDfile
Find this compound or compounds like it in BindingDB:
Activity Spreadsheet -- Enzyme Inhibition Constant Data from BindingDB
Found 1 hit for monomerid = 50388645
TargetNuclear receptor subfamily 1 group D member 1(Homo sapiens (Human))
The Scripps Research Institute
Curated by ChEMBL
LigandPNGBDBM50388645(CHEMBL2059572)
Affinity DataEC50:  670nM. Assay description: Agonist activity at Rev-Erbalpha expressed in HEK293 cells coexpressing BamII promoter assessed as repression of transcription after 24 hrs by dual-G...
In DepthDetails ArticlePubMed