BDBM50388652 CHEMBL2059541
SMILES CC(C)(C)OC(=O)CN(Cc1ccc(s1)[N+]([O-])=O)Cc1ccc(cc1)[N+]([O-])=O
InChI Key InChIKey=YGRPLPGSSJYJNO-UHFFFAOYSA-N
Data  1 EC50
  Tab Delimited (TSV)   2D SDfile   Computed 3D by Vconf -m prep SDfile
Find this compound or compounds like it in BindingDB:
Activity Spreadsheet -- Enzyme Inhibition Constant Data from BindingDB
Found 1 hit for monomerid = 50388652
TargetNuclear receptor subfamily 1 group D member 1(Homo sapiens (Human))
The Scripps Research Institute
Curated by ChEMBL
LigandPNGBDBM50388652(CHEMBL2059541)
Affinity DataEC50:  2.50E+3nM. Assay description: Agonist activity at Rev-Erbalpha expressed in HEK293 cells coexpressing BamII promoter assessed as repression of transcription after 24 hrs by dual-G...
In DepthDetails ArticlePubMed