BDBM50388814 CHEMBL2062709
SMILES CCCCCCCCCCCCCCCC(NCc1ccc(cc1)N(C)C)=C1C(=O)OC(CO)C1=O
InChI Key InChIKey=OUEUCFSTVBXIEQ-UHFFFAOYSA-N
Data  7 IC50
  Tab Delimited (TSV)   2D SDfile   Computed 3D by Vconf -m prep SDfile
Find this compound or compounds like it in BindingDB:
Activity Spreadsheet -- Enzyme Inhibition Constant Data from BindingDB
Found 7 hits for monomerid = 50388814
TargetDual specificity protein phosphatase 1(Homo sapiens (Human))
TBA
Curated by ChEMBL
LigandPNGBDBM50388814(CHEMBL2062709)
Affinity DataIC50: >1.00E+5nM. Assay description: Inhibition of MKP1
In DepthDetails ArticlePubMed
TargetDual specificity protein phosphatase 6(Homo sapiens (Human))
TBA
Curated by ChEMBL
LigandPNGBDBM50388814(CHEMBL2062709)
Affinity DataIC50: >1.00E+5nM. Assay description: Inhibition of MKP3
In DepthDetails ArticlePubMed
TargetM-phase inducer phosphatase 1(Homo sapiens (Human))
TBA
Curated by ChEMBL
LigandPNGBDBM50388814(CHEMBL2062709)
Affinity DataIC50:  8.67E+3nM. Assay description: Inhibition of CDC25A
In DepthDetails ArticlePubMed
TargetTyrosine-protein phosphatase non-receptor type 1(Homo sapiens (Human))
TBA
Curated by ChEMBL
LigandPNGBDBM50388814(CHEMBL2062709)
Affinity DataIC50: >1.00E+5nM. Assay description: Inhibition of PTP1B
In DepthDetails ArticlePubMed
TargetM-phase inducer phosphatase 3(Homo sapiens (Human))
TBA
Curated by ChEMBL
LigandPNGBDBM50388814(CHEMBL2062709)
Affinity DataIC50: >1.00E+5nM. Assay description: Inhibition of CDC25C
In DepthDetails ArticlePubMed
TargetDual specificity protein phosphatase 3(Homo sapiens (Human))
TBA
Curated by ChEMBL
LigandPNGBDBM50388814(CHEMBL2062709)
Affinity DataIC50:  1.20E+4nM. Assay description: Inhibition of VHR
In DepthDetails ArticlePubMed
TargetM-phase inducer phosphatase 2(Homo sapiens (Human))
TBA
Curated by ChEMBL
LigandPNGBDBM50388814(CHEMBL2062709)
Affinity DataIC50:  6.23E+3nM. Assay description: Inhibition of CDC25B
In DepthDetails ArticlePubMed