BDBM50388994 CHEMBL2063897
SMILES CCc1c(c(c(C(O)=O)n1C)-c1cccc(c1)N1CCN(CC1)c1ccc(NS(=O)(=O)c2ccc(N[C@H](CCN(C)C)CSc3ccccc3)c(c2)[N+]([O-])=O)cc1)-c1ccc(Cl)cc1
InChI Key InChIKey=JSQHULXAAXJOKC-DIPNUNPCSA-N
Data  1 KI  5 IC50
  Tab Delimited (TSV)   2D SDfile   Computed 3D by Vconf -m prep SDfile
Find this compound or compounds like it in BindingDB:
Activity Spreadsheet -- Enzyme Inhibition Constant Data from BindingDB
Found 6 hits for monomerid = 50388994
TargetApoptosis regulator Bcl-2(Homo sapiens (Human))
University Of Michigan
Curated by ChEMBL
LigandPNGBDBM50388994(CHEMBL2063897)
Affinity DataKi:  0.800nM. Assay description: Binding affinity to N-terminus 6X His-tagged human Bcl2 expressed in Escherichia coli BL21 (DE3) cells after 2 hrs by fluorescence polarization assay
In DepthDetails ArticlePubMed
TargetBcl-2-like protein 1(Homo sapiens (Human))
University Of Michigan
Curated by ChEMBL
LigandPNGBDBM50388994(CHEMBL2063897)
Affinity DataIC50:  7.5nM. Assay description: Inhibition of human N-terminal His8-tagged Bcl-XL expressed in Escherichia coli BL21(DE3) assessed as inhibition of Fluorescein-labeled BAK binding a...
In DepthDetails ArticlePubMed
TargetInduced myeloid leukemia cell differentiation protein Mcl-1(Homo sapiens (Human))
University Of Michigan
Curated by ChEMBL
LigandPNGBDBM50388994(CHEMBL2063897)
Affinity DataIC50: >2.00E+3nM. Assay description: Binding affinity to N-terminus 8X His-tagged human Mcl1 expressed in Escherichia coli BL21 (DE3) cells after 2 hrs by fluorescence polarization assay
In DepthDetails ArticlePubMed
TargetBcl-2-like protein 1(Homo sapiens (Human))
University Of Michigan
Curated by ChEMBL
LigandPNGBDBM50388994(CHEMBL2063897)
Affinity DataIC50:  7.5nM. Assay description: Binding affinity to N-terminus 8X His-tagged human Bcl-xL expressed in Escherichia coli BL21 (DE3) cells after 2 hrs by fluorescence polarization ass...
In DepthDetails ArticlePubMed
TargetInduced myeloid leukemia cell differentiation protein Mcl-1(Homo sapiens (Human))
University Of Michigan
Curated by ChEMBL
LigandPNGBDBM50388994(CHEMBL2063897)
Affinity DataIC50: >2.00E+3nM. Assay description: Inhibition of human N-terminal His8-tagged Mcl1 expressed in Escherichia coli BL21(DE3) assessed as inhibition of Fluorescein-labeled BID binding aft...
In DepthDetails ArticlePubMed
TargetApoptosis regulator Bcl-2(Homo sapiens (Human))
University Of Michigan
Curated by ChEMBL
LigandPNGBDBM50388994(CHEMBL2063897)
Affinity DataIC50:  4.10nM. Assay description: Binding affinity to N-terminus 6X His-tagged human Bcl2 expressed in Escherichia coli BL21 (DE3) cells after 2 hrs by fluorescence polarization assay
In DepthDetails ArticlePubMed