BDBM50389015 CHEMBL2064172::US9321743, URB784
SMILES O=C(NCc1ccccc1)N[C@H]1COC1=O
InChI Key InChIKey=GDHGDHVKWNQBBY-VIFPVBQESA-N
Data  2 IC50
  Tab Delimited (TSV)   2D SDfile   Computed 3D by Vconf -m prep SDfile
Find this compound or compounds like it in BindingDB:
Activity Spreadsheet -- Enzyme Inhibition Constant Data from BindingDB
Found 2 hits for monomerid = 50389015
TargetN-acylethanolamine-hydrolyzing acid amidase(Rattus norvegicus (Rat))
Universit£
Curated by ChEMBL
LigandPNGBDBM50389015(CHEMBL2064172 | US9321743, URB784)
Affinity DataIC50:  1.50E+4nM. Assay description: Inhibition of rat recombinant NAAA expressed in HEK293 cells using heptadecenoylethanolamide as substrate after 30 mins by LC/MS analysis
In DepthDetails ArticlePubMed
TargetN-acylethanolamine-hydrolyzing acid amidase(Rattus norvegicus (Rat))
Universit£
Curated by ChEMBL
LigandPNGBDBM50389015(CHEMBL2064172 | US9321743, URB784)
Affinity DataIC50:  1.50E+4nMpH: 5.0 T: 2°C. Assay description: Recombinant NAAA or native rat lung NAAA was incubated at 37 °C. for 30 min in 0.2 ml of sodium hydrogen phosphate buffer (50 mM, pH 5.0) contain...
In DepthDetails US Patent