BDBM50389070 CHEMBL2064343
SMILES O=c1cc(nc(Cc2nc3ccccc3n2C2CCCCC2)[nH]1)N1CCOCC1
InChI Key InChIKey=FLQGKGPZQLXFCH-UHFFFAOYSA-N
Data  7 IC50
  Tab Delimited (TSV)   2D SDfile   Computed 3D by Vconf -m prep SDfile
Find this compound or compounds like it in BindingDB:
Activity Spreadsheet -- Enzyme Inhibition Constant Data from BindingDB
Found 7 hits for monomerid = 50389070
TargetPhosphatidylinositol 4,5-bisphosphate 3-kinase catalytic subunit beta isoform(Homo sapiens (Human))
Sanofi Research & Development
Curated by ChEMBL
LigandPNGBDBM50389070(CHEMBL2064343)
Affinity DataIC50:  90nM. Assay description: Inhibition of N-terminus poly-His tagged human PI3Kbeta expressed in baculovirus infected insect S21 cells coexpressing p85alpha using PI(4,5)P2 as s...
In DepthDetails ArticlePubMed
TargetPhosphatidylinositol 4,5-bisphosphate 3-kinase catalytic subunit alpha isoform(Homo sapiens (Human))
Sanofi Research & Development
Curated by ChEMBL
LigandPNGBDBM50389070(CHEMBL2064343)
Affinity DataIC50:  8.40E+3nM. Assay description: Inhibition of N-terminus poly-His tagged human PI3Kalpha expressed in baculovirus infected insect sf9 cells coexpressing p85alpha using PI(4,5)P2 as ...
In DepthDetails ArticlePubMed
TargetSerine/threonine-protein kinase mTOR(Homo sapiens (Human))
Sanofi Research & Development
Curated by ChEMBL
LigandPNGBDBM50389070(CHEMBL2064343)
Affinity DataIC50: >1.00E+4nM. Assay description: Inhibition of mTOR
In DepthDetails ArticlePubMed
TargetCytochrome P450 3A4(Homo sapiens (Human))
Sanofi Research & Development
Curated by ChEMBL
LigandPNGBDBM50389070(CHEMBL2064343)
Affinity DataIC50: >4.00E+4nM. Assay description: Inhibition of human recombinant CPY3A4
In DepthDetails ArticlePubMed
TargetPhosphatidylinositol 4,5-bisphosphate 3-kinase catalytic subunit beta isoform(Homo sapiens (Human))
Sanofi Research & Development
Curated by ChEMBL
LigandPNGBDBM50389070(CHEMBL2064343)
Affinity DataIC50:  142nM. Assay description: Inhibition of human PI3Kbeta-mediated Akt phosphorylation at Ser473 residue expressed in PTEN-deficient human PC3 cells by chemiluminescence assay
In DepthDetails ArticlePubMed
TargetPhosphatidylinositol 4,5-bisphosphate 3-kinase catalytic subunit delta isoform(Homo sapiens (Human))
Sanofi Research & Development
Curated by ChEMBL
LigandPNGBDBM50389070(CHEMBL2064343)
Affinity DataIC50:  21nM. Assay description: Inhibition of poly-His tagged human PI3Kdelta expressed in baculovirus infected insect sf9 cells coexpressing p85alpha using PI(4,5)P2 as substrate p...
In DepthDetails ArticlePubMed
TargetPhosphatidylinositol 4,5-bisphosphate 3-kinase catalytic subunit gamma isoform(Homo sapiens (Human))
Sanofi Research & Development
Curated by ChEMBL
LigandPNGBDBM50389070(CHEMBL2064343)
Affinity DataIC50: >1.00E+4nM. Assay description: Inhibition of N-terminus poly-His tagged human PI3Kgamma expressed in baculovirus infected insect sf9 cells using PI(4,5)P2 as substrate preincubated...
In DepthDetails ArticlePubMed