BDBM50389244 CHEMBL2063455
SMILES Nc1n[nH]c2cccc(C(=O)Nc3cccc(CNC(=O)Nc4cccc(F)c4)c3)c12
InChI Key InChIKey=OBLJYGNLZAQGGQ-UHFFFAOYSA-N
Data  2 IC50
  Tab Delimited (TSV)   2D SDfile   Computed 3D by Vconf -m prep SDfile
Find this compound or compounds like it in BindingDB:
Activity Spreadsheet -- Enzyme Inhibition Constant Data from BindingDB
Found 2 hits for monomerid = 50389244
TargetAurora kinase A(Homo sapiens (Human))
Abbott Laboratories
Curated by ChEMBL
LigandPNGBDBM50389244(CHEMBL2063455)
Affinity DataIC50:  1.28E+3nM. Assay description: Inhibition of Aurora A kinase by HTRF analysis in presence of 1 mM ATP
In DepthDetails ArticlePubMed
TargetAurora kinase B(Homo sapiens (Human))
Abbott Laboratories
Curated by ChEMBL
LigandPNGBDBM50389244(CHEMBL2063455)
Affinity DataIC50:  18nM. Assay description: Inhibition of Aurora B kinase by HTRF analysis in presence of 1 mM ATP
In DepthDetails ArticlePubMed