BDBM50389482 CHEMBL1699292
SMILES O=c1nccc(NCc2ccco2)[nH]1
InChI Key InChIKey=PPZNKEWLJJEHRV-UHFFFAOYSA-N
Data  1 KI
PDB links: 1 PDB ID matches this monomer.
  Tab Delimited (TSV)   2D SDfile   Computed 3D by Vconf -m prep SDfile
Find this compound or compounds like it in BindingDB:
Activity Spreadsheet -- Enzyme Inhibition Constant Data from BindingDB
Found 1 hit for monomerid = 50389482
TargetOrphan methyltransferase M.SssI(Spiroplasma monobiae strain MQ-1)
Polish Academy Of Sciences
Curated by ChEMBL
LigandPNGBDBM50389482(CHEMBL1699292)
Affinity DataKi:  7.00E+4nM. Assay description: Competitive inhibition of Spiroplasma sp. MQ1 SssI methyltransferase using pUC18 as substrate measured for 10 mins by Dixon plot analysis
In DepthDetails ArticlePubMed