BDBM50389484 CHEMBL2063065
SMILES CCNc1cc[nH]c(=O)n1
InChI Key InChIKey=TVICROIWXBFQEL-UHFFFAOYSA-N
Data  1 KI
  Tab Delimited (TSV)   2D SDfile   Computed 3D by Vconf -m prep SDfile
Find this compound or compounds like it in BindingDB:
Activity Spreadsheet -- Enzyme Inhibition Constant Data from BindingDB
Found 1 hit for monomerid = 50389484
TargetOrphan methyltransferase M.SssI(Spiroplasma monobiae strain MQ-1)
Polish Academy Of Sciences
Curated by ChEMBL
LigandPNGBDBM50389484(CHEMBL2063065)
Affinity DataKi:  6.00E+6nM. Assay description: Uncompetitive inhibition of Spiroplasma sp. MQ1 SssI methyltransferase using pUC18 as substrate measured for 10 mins by Cornish-Bowden's plot analysi...
In DepthDetails ArticlePubMed