BDBM50389509 CHEMBL2063042
SMILES OCc1ccc(CNc2ccnc(=O)[nH]2)o1
InChI Key InChIKey=PHBJRSFXAFRHDC-UHFFFAOYSA-N
Data  1 KI
  Tab Delimited (TSV)   2D SDfile   Computed 3D by Vconf -m prep SDfile
Find this compound or compounds like it in BindingDB:
Activity Spreadsheet -- Enzyme Inhibition Constant Data from BindingDB
Found 1 hit for monomerid = 50389509
TargetOrphan methyltransferase M.SssI(Spiroplasma monobiae strain MQ-1)
Polish Academy Of Sciences
Curated by ChEMBL
LigandPNGBDBM50389509(CHEMBL2063042)
Affinity DataKi:  7.00E+5nM. Assay description: Competitive inhibition of Spiroplasma sp. MQ1 SssI methyltransferase using pUC18 as substrate measured for 10 mins by Dixon plot analysis
In DepthDetails ArticlePubMed