BDBM50389689 CHEMBL2070055::US10544104, Compound 12::US11247972, Compound 12::US9765037, Compound 12
SMILES CCCOc1ccc2cc(ccc2c1)-c1nn(C(C)C)c2ncnc(N)c12
InChI Key InChIKey=NVFPMSWRLJYMJE-UHFFFAOYSA-N
Data  14 IC50
  Tab Delimited (TSV)   2D SDfile   Computed 3D by Vconf -m prep SDfile
Find this compound or compounds like it in BindingDB:
Activity Spreadsheet -- Enzyme Inhibition Constant Data from BindingDB
Found 14 hits for monomerid = 50389689
TargetProto-oncogene tyrosine-protein kinase Src(Homo sapiens (Human))
University Of Washington
Curated by ChEMBL
LigandPNGBDBM50389689(CHEMBL2070055 | US10544104, Compound 12 | US112479...)
Affinity DataIC50:  300nM. Assay description: Inhibition of human SRC using Ac-EIYGEFKKK-OH as substrate after 60 mins by phosphorimaging method
In DepthDetails ArticlePubMed
TargetCalmodulin-domain protein kinase 1(Toxoplasma gondii)
University Of Washington Through Its Center For Commercialization
US Patent
LigandPNGBDBM50389689(CHEMBL2070055 | US10544104, Compound 12 | US112479...)
Affinity DataIC50:  3.20nM. Assay description: Most known kinase inhibitors bind in the ATP-binding pocket of the active site19,20. These inhibitors exploit many of the same hydrophobic contacts a...
In DepthDetails US Patent
TargetCalcium-dependent protein kinase 1(Cryptosporidium parvum)
University Of Washington Through Its Center For Commercialization
US Patent
LigandPNGBDBM50389689(CHEMBL2070055 | US10544104, Compound 12 | US112479...)
Affinity DataIC50:  53.2nM. Assay description: Two types of enzyme assays were developed to follow TgCDPK1 activity, a radiometric scintillation proximity assay measured the labeled γ-phospha...
In DepthDetails US Patent
TargetProto-oncogene tyrosine-protein kinase Src(Homo sapiens (Human))
University Of Washington
Curated by ChEMBL
LigandPNGBDBM50389689(CHEMBL2070055 | US10544104, Compound 12 | US112479...)
Affinity DataIC50:  298nM. Assay description: Inhibition of human tyrosine kinases.
In DepthDetails US Patent
TargetTyrosine-protein kinase ABL1(Homo sapiens (Human))
University Of Washington Through Its Center For Commercialization
US Patent
LigandPNGBDBM50389689(CHEMBL2070055 | US10544104, Compound 12 | US112479...)
Affinity DataIC50:  838nM. Assay description: Inhibition of human tyrosine kinases.
In DepthDetails US Patent
TargetTyrosine-protein kinase HCK(Homo sapiens (Human))
University Of Washington Through Its Center For Commercialization
US Patent
LigandPNGBDBM50389689(CHEMBL2070055 | US10544104, Compound 12 | US112479...)
Affinity DataIC50:  244nM. Assay description: Inhibition of human tyrosine kinases.
In DepthDetails US Patent
TargetCalcium/calmodulin dependent protein kinase with a kinas domain and 4 calmodulin-like EF hands(Cryptosporidium parvum (strain Iowa II))
University Of Washington Through Its Center For Commercialization
US Patent
LigandPNGBDBM50389689(CHEMBL2070055 | US10544104, Compound 12 | US112479...)
Affinity DataIC50:  53.2nM. Assay description: Inhibition of TgCDPK1 and CpCDPK1 was determined using a luminescent kinase assay which measures ATP depletion in the presence of the Syntide 2 pepti...
In DepthDetails US Patent
TargetCalmodulin-domain protein kinase 1, putative(Cryptosporidium parvum (strain Iowa II))
University Of Washington Through Its Center For
US Patent
LigandPNGBDBM50389689(CHEMBL2070055 | US10544104, Compound 12 | US112479...)
Affinity DataIC50:  53.2nM. Assay description: Inhibition of TgCDPK1 and CpCDPK1 was determined using a luminescent kinase assay which measures ATP depletion in the presence of the Syntide 2 pepti...
In DepthDetails US Patent
TargetProto-oncogene tyrosine-protein kinase Src(Homo sapiens (Human))
University Of Washington
Curated by ChEMBL
LigandPNGBDBM50389689(CHEMBL2070055 | US10544104, Compound 12 | US112479...)
Affinity DataIC50:  298nM. Assay description: Inhibition of TgCDPK1 and CpCDPK1 was determined using a luminescent kinase assay which measures ATP depletion in the presence of the Syntide 2 pepti...
In DepthDetails US Patent
TargetProto-oncogene tyrosine-protein kinase Src(Homo sapiens (Human))
University Of Washington
Curated by ChEMBL
LigandPNGBDBM50389689(CHEMBL2070055 | US10544104, Compound 12 | US112479...)
Affinity DataIC50:  307nM. Assay description: Inhibition of TgCDPK1 and CpCDPK1 was determined using a luminescent kinase assay which measures ATP depletion in the presence of the Syntide 2 pepti...
In DepthDetails US Patent
TargetTyrosine-protein kinase ABL1(Homo sapiens (Human))
University Of Washington Through Its Center For Commercialization
US Patent
LigandPNGBDBM50389689(CHEMBL2070055 | US10544104, Compound 12 | US112479...)
Affinity DataIC50:  838nM. Assay description: Inhibition of TgCDPK1 and CpCDPK1 was determined using a luminescent kinase assay which measures ATP depletion in the presence of the Syntide 2 pepti...
In DepthDetails US Patent
TargetTyrosine-protein kinase HCK(Homo sapiens (Human))
University Of Washington Through Its Center For Commercialization
US Patent
LigandPNGBDBM50389689(CHEMBL2070055 | US10544104, Compound 12 | US112479...)
Affinity DataIC50:  244nM. Assay description: Inhibition of TgCDPK1 and CpCDPK1 was determined using a luminescent kinase assay which measures ATP depletion in the presence of the Syntide 2 pepti...
In DepthDetails US Patent
TargetcGMP-dependent protein kinase()
University Of Washington Through Its Center For Commercialization
US Patent
LigandPNGBDBM50389689(CHEMBL2070055 | US10544104, Compound 12 | US112479...)
Affinity DataIC50:  3.20nM. Assay description: Inhibition of TgCDPK1 and CpCDPK1 was determined using a luminescent kinase assay which measures ATP depletion in the presence of the Syntide 2 pepti...
In DepthDetails US Patent
TargetCalmodulin-domain protein kinase 1(Toxoplasma gondii)
University Of Washington Through Its Center For Commercialization
US Patent
LigandPNGBDBM50389689(CHEMBL2070055 | US10544104, Compound 12 | US112479...)
Affinity DataIC50:  3.20nM. Assay description: Inhibition of TgCDPK1 and CpCDPK1 was determined using a luminescent kinase assay which measures ATP depletion in the presence of the Syntide 2 pepti...
In DepthDetails US Patent