BDBM50389701 CHEMBL2070068::US10544104, Compound 56::US11247972, Compound 56::US9765037, Compound 56
SMILES CC(C)n1nc(-c2ccc3cc(OCc4ccc(Cl)cc4)ccc3c2)c2c(N)ncnc12
InChI Key InChIKey=XCFKTIVHIIOEHO-UHFFFAOYSA-N
Data  7 IC50
  Tab Delimited (TSV)   2D SDfile   Computed 3D by Vconf -m prep SDfile
Find this compound or compounds like it in BindingDB:
Activity Spreadsheet -- Enzyme Inhibition Constant Data from BindingDB
Found 7 hits for monomerid = 50389701
TargetProto-oncogene tyrosine-protein kinase Src(Homo sapiens (Human))
University Of Washington
Curated by ChEMBL
LigandPNGBDBM50389701(CHEMBL2070068 | US10544104, Compound 56 | US112479...)
Affinity DataIC50:  270nM. Assay description: Inhibition of human SRC using Ac-EIYGEFKKK-OH as substrate after 60 mins by phosphorimaging method
In DepthDetails ArticlePubMed
TargetCalmodulin-domain protein kinase 1(Toxoplasma gondii)
University Of Washington Through Its Center For Commercialization
US Patent
LigandPNGBDBM50389701(CHEMBL2070068 | US10544104, Compound 56 | US112479...)
Affinity DataIC50:  4nM. Assay description: Most known kinase inhibitors bind in the ATP-binding pocket of the active site19,20. These inhibitors exploit many of the same hydrophobic contacts a...
In DepthDetails US Patent
TargetCalcium-dependent protein kinase 1(Cryptosporidium parvum)
University Of Washington Through Its Center For Commercialization
US Patent
LigandPNGBDBM50389701(CHEMBL2070068 | US10544104, Compound 56 | US112479...)
Affinity DataIC50:  105nM. Assay description: Two types of enzyme assays were developed to follow TgCDPK1 activity, a radiometric scintillation proximity assay measured the labeled γ-phospha...
In DepthDetails US Patent
TargetCalcium/calmodulin dependent protein kinase with a kinas domain and 4 calmodulin-like EF hands(Cryptosporidium parvum (strain Iowa II))
University Of Washington Through Its Center For Commercialization
US Patent
LigandPNGBDBM50389701(CHEMBL2070068 | US10544104, Compound 56 | US112479...)
Affinity DataIC50:  105nM. Assay description: Inhibition of TgCDPK1 and CpCDPK1 was determined using a luminescent kinase assay which measures ATP depletion in the presence of the Syntide 2 pepti...
In DepthDetails US Patent
TargetCalmodulin-domain protein kinase 1, putative(Cryptosporidium parvum (strain Iowa II))
University Of Washington Through Its Center For
US Patent
LigandPNGBDBM50389701(CHEMBL2070068 | US10544104, Compound 56 | US112479...)
Affinity DataIC50:  105nM. Assay description: Inhibition of TgCDPK1 and CpCDPK1 was determined using a luminescent kinase assay which measures ATP depletion in the presence of the Syntide 2 pepti...
In DepthDetails US Patent
TargetcGMP-dependent protein kinase()
University Of Washington Through Its Center For Commercialization
US Patent
LigandPNGBDBM50389701(CHEMBL2070068 | US10544104, Compound 56 | US112479...)
Affinity DataIC50:  4nM. Assay description: Inhibition of TgCDPK1 and CpCDPK1 was determined using a luminescent kinase assay which measures ATP depletion in the presence of the Syntide 2 pepti...
In DepthDetails US Patent
TargetCalmodulin-domain protein kinase 1(Toxoplasma gondii)
University Of Washington Through Its Center For Commercialization
US Patent
LigandPNGBDBM50389701(CHEMBL2070068 | US10544104, Compound 56 | US112479...)
Affinity DataIC50:  4nM. Assay description: Inhibition of TgCDPK1 and CpCDPK1 was determined using a luminescent kinase assay which measures ATP depletion in the presence of the Syntide 2 pepti...
In DepthDetails US Patent