BDBM50390121 CHEMBL2069664
SMILES CCOc1cc(\C=N\NC(=O)C(OC)c2ccc3OCCOc3c2)cc(Br)c1OC
InChI Key InChIKey=WYOYGJGJDSZYMF-FSJBWODESA-N
Data  1 IC50
  Tab Delimited (TSV)   2D SDfile   Computed 3D by Vconf -m prep SDfile
Find this compound or compounds like it in BindingDB:
Activity Spreadsheet -- Enzyme Inhibition Constant Data from BindingDB
Found 1 hit for monomerid = 50390121
LigandPNGBDBM50390121(CHEMBL2069664)
Affinity DataIC50:  9nM. Assay description: Inhibition of mouse PDE10A-mediated hydrolysis of [3H]cGMP to [3H]GMP after 20 mins by scintillation counting
In DepthDetails ArticlePubMed