BDBM50390142 CHEMBL2069688
SMILES COC(C(=O)N\N=C\c1cc(OC)c(Br)c(OC)c1)c1ccnc2ccccc12
InChI Key InChIKey=VAJMNYFMYBAXAB-WYMPLXKRSA-N
Data  1 IC50
  Tab Delimited (TSV)   2D SDfile   Computed 3D by Vconf -m prep SDfile
Find this compound or compounds like it in BindingDB:
Activity Spreadsheet -- Enzyme Inhibition Constant Data from BindingDB
Found 1 hit for monomerid = 50390142
LigandPNGBDBM50390142(CHEMBL2069688)
Affinity DataIC50:  3.90nM. Assay description: Inhibition of mouse PDE10A-mediated hydrolysis of [3H]cGMP to [3H]GMP after 20 mins by scintillation counting
In DepthDetails ArticlePubMed